{"text_format":"1","workbook":"xlsx","n_sheets":24,"sheets":["AEP Tariffs","TNCRate code Table","SharyRate code Table","TCCRate code Table","Discretionary Fees","SharyResidential","SharySec<10KW","SharySec>=10KW","Shary StreetLgt","TCCResidential","TCCSec<10KW","TCCSec>=10KW","TCCPrimary","TCCTrans","TCC StreetLgt","TCC NonRoadway","TNCResidential","TNCSec<10KW","TNCSec>=10KW","TNCPrimary","TNCTrans","TNC StreetLgt","TNC NonRoadway","Transmission"],"not_rendered":{"charts":0,"images":0,"macros":1,"external_links":0,"defined_names":39,"comments":13,"pivot_tables":0},"unopened":[],"bounds":{"document_bytes":16777216,"sheet_cells":100000,"rows_first":2000,"rows_last":500,"rows_between":2000,"halvings":0,"cell_chars":16384,"cell_head_chars":4096},"cells_cut":0,"cells_raw":0,"read":"whole","date_system":"1900"}

{"sheet":"AEP Tariffs","index":0,"n_rows":4,"n_cols":2,"rows_kept":4,"cut":false,"hidden":false,"merged":[[3,1,3,9]]}
[]
[]
[]
[null,"AEP Texas Tariffs"]

{"sheet":"TNCRate code Table","index":1,"n_rows":68,"n_cols":27,"rows_kept":68,"cut":false,"hidden":false,"merged":[]}
["AEP TEXAS - NORTH AREA",null,null,null,null,null,null,null,null,null,null,null,null,null,null,null,null,null,null,null,null,null,null,null,null,820,{"$f":"VLOOKUP(Z$1,A$8:C$106,3,FALSE)","v":"Residential"}]
[null,null,null,null,null,null,null,null,null,null,null,null,null,null,null,null,null,null,null,null,null,null,null,null,null,false]
[941,null,null,null,null,null,null,null,null,null,null,null,null,null,null,null,null,null,null,null,null,null,null,null,null,{"$f":"ISNA(VLOOKUP(Z$1,A$8:A$106,1,FALSE))","v":false}]
[]
[]
["Tariff","AEP Texas - North Area"]
["Code","Tariffs","Additional Tariff Description"]
[820,"Residential Service","Residential"]
[824,"Secondary Voltage Service Less Than or Equal to 10 kW","Metered Highway Safety Lighting"]
[825,"Secondary Voltage Service Less Than or Equal to 10 kW","Customer Owned Lighting"]
{"$rows_left_out":59}
{"sheet":"SharyRate code Table","index":2,"n_rows":81,"n_cols":27,"rows_kept":81,"cut":false,"hidden":false,"merged":[]}
["AEP TEXAS - SHARYLAND AREA",null,null,null,null,null,null,null,null,null,null,null,null,null,null,null,null,null,null,null,null,null,null,null,null,990,{"$f":"VLOOKUP(Z$1,A$8:C$102,3,FALSE)","v":"150 W High Pressure Sodium"}]
[null,null,null,null,null,null,null,null,null,null,null,null,null,null,null,null,null,null,null,null,null,null,null,null,null,false]
[null,null,null,null,null,null,null,null,null,null,null,null,null,null,null,null,null,null,null,null,null,null,null,null,null,{"$f":"ISNA(VLOOKUP(Z$1,A$8:A$102,1,FALSE))","v":false}]
[]
[null,836]
["Tariff","AEP Texas - Sharyland Area"]
["Code","Tariffs","Additional Tariff Description"]
[822,"Residential Service","Residential"]
[825,"Secondary Voltage Service Less Than or Equal to 10 kW","Commercial Energy without IDR meter"]
[881,"Secondary Voltage Service Greater Then 10 kW","Commercial Demand Without IDR Meter"]
{"$rows_left_out":72}
{"sheet":"TCCRate code Table","index":3,"n_rows":88,"n_cols":27,"rows_kept":88,"cut":false,"hidden":false,"merged":[]}
["AEP TEXAS - CENTRAL AREA",null,null,null,null,null,null,null,null,null,null,null,null,null,null,null,null,null,null,null,null,null,null,null,null,945,{"$f":"VLOOKUP(Z$1,A$8:C$102,3,FALSE)","v":"100 W High Pressure Sodium"}]
[null,null,null,null,null,null,null,null,null,null,null,null,null,null,null,null,null,null,null,null,null,null,null,null,null,false]
[890,null,null,null,null,null,null,null,null,null,null,null,null,null,null,null,null,null,null,null,null,null,null,null,null,{"$f":"ISNA(VLOOKUP(Z$1,A$8:A$102,1,FALSE))","v":false}]
[]
[null,836]
["Tariff","AEP Texas - Central Area"]
["Code","Tariffs","Additional Tariff Description"]
[820,"Residential Service","Residential"]
[826,"Secondary Voltage Service Less Than or Equal to 10 kW","Recreational Night Lighting"]
[827,"Secondary Voltage Service Less Than or Equal to 10 kW","Commercial Demand without IDR meter"]
{"$rows_left_out":79}
{"sheet":"Discretionary Fees","index":4,"n_rows":130,"n_cols":9,"rows_kept":130,"cut":false,"hidden":false,"merged":[[7,0,7,8],[80,0,80,8],[121,0,121,8]]}
[]
[]
["Discretionary Charges for AEP TX - Central Area, North Area, and Sharyland Area"]
[null,null,"Central &","Central &","Central &","North","North","North"]
[null,null,"Sharyland Areas","Sharyland Areas","Sharyland Areas","Area","Area","Area","810_02"]
[null,null,"Standard Mtr","Non-Standard Mtr","AMS-M-Mtr","Standard Mtr","Non-Standard Mtr","AMS-M-Mtr","SAC04"]
["Description of Charge or Rider",null,null,null,null,null,null,null,"Code"]
["Mandatory Services"]
["Standard Move-in"]
[null,"Self -Contained Meter (existing)",null,"N/A",3,0,"N/A",1,"SER019"]
{"$rows_left_out":121}
{"sheet":"SharyResidential","index":5,"n_rows":68,"n_cols":13,"rows_kept":68,"cut":false,"hidden":false,"merged":[[0,0,0,1],[6,3,6,4],[6,8,6,12],[7,3,7,4],[8,0,8,1],[1,0,1,1],[2,0,2,1],[3,0,3,1]]}
["AEP Texas - Sharyland Area"]
[{"$f":"IF(A3=\"All Rate Codes\",\"Billing Determinants for\",\"Billing Determinants for Rate Code\")","v":"Billing Determinants for"}]
["All Rate Codes"]
[{"$f":"IF(A3=\"All Rate Codes\",\"\",VLOOKUP(A3,'SharyRate code Table'!A8:C202,3,FALSE))","v":""}]
["RESIDENTIAL  SERVICE"]
[null,null,"810_02",null,null,null,null,"Estimated"]
[null,null,"SAC04","Approved Rate",null,"Docket","Effective","Revision or","Applicable Rate Codes"]
[".",null,"Code","Cost / Unit",null," Number","Date","Termination Date",822]
["BASE CHARGES",null,null,null,null,null,null,null,"x","x","x","x","x"]
["Customer Charge",null,"BAS001",3.19,"per month",35093,"2008-01-30","Not Scheduled","x"]
{"$rows_left_out":59}
{"sheet":"SharySec<10KW","index":6,"n_rows":67,"n_cols":17,"rows_kept":67,"cut":false,"hidden":false,"merged":[[6,8,6,14],[7,3,7,4],[8,0,8,1],[0,0,0,1],[1,0,1,1],[2,0,2,1],[3,0,3,1],[6,3,6,4]]}
["AEP Texas - Sharyland Area"]
[{"$f":"IF(A3=\"All Rate Codes\",\"Billing Determinants for\",\"Billing Determinants for Rate Code\")","v":"Billing Determinants for"}]
["All Rate Codes"]
[{"$f":"IF(A3=\"All Rate Codes\",\"\",VLOOKUP(A3,'SharyRate code Table'!A8:C202,3,FALSE))","v":""}]
["SECONDARY VOLTAGE SERVICE LESS THAN OR EQUAL TO 10 KW"]
[null,null,"810_02",null,null,null,null,"Estimated"]
[null,null,"SAC04","Approved Rate",null,"Docket","Effective","Revision or","Applicable Rate Codes"]
["Description of Charge or Rider",null,"Code","Cost / Unit",null," Number","Date","Termination Date",825]
["BASE CHARGES",null,null,null,null,null,null,null,"x","x","x","x","x","x","x","X","X"]
["Customer Charge",null,"BAS001",3.2,"per month",35093,"2008-01-30","Not Scheduled","x"]
{"$rows_left_out":58}
{"sheet":"SharySec>=10KW","index":7,"n_rows":68,"n_cols":22,"rows_kept":68,"cut":false,"hidden":false,"merged":[[6,8,6,21],[7,3,7,4],[8,0,8,1],[0,0,0,1],[1,0,1,1],[2,0,2,1],[3,0,3,1],[6,3,6,4]]}
["AEP Texas - Sharyland Area"]
[{"$f":"IF(A3=\"All Rate Codes\",\"Billing Determinants for\",\"Billing Determinants for Rate Code\")","v":"Billing Determinants for"}]
["All Rate Codes"]
[{"$f":"IF(A3=\"All Rate Codes\",\"\",VLOOKUP(A3,'SharyRate code Table'!A8:C202,3,FALSE))","v":""}]
["SECONDARY VOLTAGE SERVICE GREATER THAN 10 KW"]
[null,null,"810_02",null,null,null,null,"Estimated Next"]
[null,null,"SAC04","Approved Rate",null,"Docket","Effective","Revision or","Applicable Rate Codes"]
["Description of Charge or Rider",null,"Code","Cost / Unit",null,"Number","Date","Termination Date",881,882]
["BASE CHARGES",null,null,null,null,null,null,null,"x","x","x","x","x","x","x","x","x","x","x","x","x","x"]
["Customer Charge (non-IDR Metered)",null,"BAS001",3.26,"per month",34561,"2008-03-31","Not Scheduled","x"]
{"$rows_left_out":59}
{"sheet":"Shary StreetLgt","index":8,"n_rows":22,"n_cols":12,"rows_kept":22,"cut":false,"hidden":false,"merged":[[5,8,5,11],[6,3,6,4],[7,3,7,4],[8,0,8,1],[0,0,0,1],[1,0,1,1],[2,0,2,1],[3,0,3,1]]}
["AEP Texas - Sharyland Area"]
[{"$f":"IF(A3=\"All Rate Codes\",\"Billing Determinants for\",\"Billing Determinants for Rate Code\")","v":"Billing Determinants for"}]
["All Rate Codes"]
[{"$f":"IF(A3=\"All Rate Codes\",\"\",VLOOKUP(A3,'SharyRate code Table'!A8:C202,3,FALSE))","v":""}]
["MUNICIPAL STREET LIGHTING SERVICE"]
[null,null,"810_02",null,null,null,null,"Estimated","Monthly Facilities Rate"]
[null,null,"SAC04","Approved Rate",null,"Docket","Effective","Revision or","Rate",null,"kWh","Facility"]
["Description of Charge or Rider",null,"Code","Cost / Unit",null,"Number","Date","Termination Date","Code","Description","Usage","Price"]
["BASE CHARGES",null,null,null,null,null,null,null,null,"Metal Halide (MH)"]
["Customer Charge",null,"BAS001",3.2,"per month",35093,"2008-01-30","Not Scheduled",993,"MH 175 Watt ",75,6.7]
{"$rows_left_out":13}
{"sheet":"TCCResidential","index":9,"n_rows":68,"n_cols":13,"rows_kept":68,"cut":false,"hidden":false,"merged":[[0,0,0,1],[6,8,6,12],[8,0,8,1],[6,3,6,4],[7,3,7,4],[3,0,3,1],[1,0,1,1],[2,0,2,1]]}
["AEP Texas - Central Area"]
[{"$f":"IF(A3=\"All Rate Codes\",\"Billing Determinants for\",\"Billing Determinants for Rate Code\")","v":"Billing Determinants for"}]
["All Rate Codes"]
[{"$f":"IF(A3=\"All Rate Codes\",\"\",VLOOKUP(A3,'TCCRate code Table'!A8:C202,3,FALSE))","v":""}]
["RESIDENTIAL  SERVICE"]
[null,null,"810_02",null,null,null,null,"Estimated"]
[null,null,"SAC04","Approved Rate",null,"Docket","Effective","Revision or","Applicable Rate Codes"]
[".",null,"Code","Cost / Unit",null," Number","Date","Termination Date",820]
["BASE CHARGES",null,null,null,null,null,null,null,"x","x","x","x","x"]
["Customer Charge",null,"BAS001",3.19,"per month",35093,"2008-01-30","Not Scheduled","x"]
{"$rows_left_out":59}
{"sheet":"TCCSec<10KW","index":10,"n_rows":67,"n_cols":17,"rows_kept":67,"cut":false,"hidden":false,"merged":[[6,8,6,14],[8,0,8,1],[6,3,6,4],[7,3,7,4],[0,0,0,1],[1,0,1,1],[2,0,2,1],[3,0,3,1]]}
["AEP Texas - Central Area"]
[{"$f":"IF(A3=\"All Rate Codes\",\"Billing Determinants for\",\"Billing Determinants for Rate Code\")","v":"Billing Determinants for"}]
["All Rate Codes"]
[{"$f":"IF(A3=\"All Rate Codes\",\"\",VLOOKUP(A3,'TCCRate code Table'!A8:C202,3,FALSE))","v":""}]
["SECONDARY VOLTAGE SERVICE LESS THAN OR EQUAL TO 10 KW"]
[null,null,"810_02",null,null,null,null,"Estimated"]
[null,null,"SAC04","Approved Rate",null,"Docket","Effective","Revision or","Applicable Rate Codes"]
["Description of Charge or Rider",null,"Code","Cost / Unit",null," Number","Date","Termination Date",826,827,828,829,850,851,852]
["BASE CHARGES",null,null,null,null,null,null,null,"x","x","x","x","x","x","x","X","X"]
["Customer Charge",null,"BAS001",3.2,"per month",35093,"2008-01-30","Not Scheduled","x","x","x","x","x","x","x"]
{"$rows_left_out":58}
{"sheet":"TCCSec>=10KW","index":11,"n_rows":68,"n_cols":22,"rows_kept":68,"cut":false,"hidden":false,"merged":[[6,8,6,21],[8,0,8,1],[6,3,6,4],[7,3,7,4],[0,0,0,1],[1,0,1,1],[2,0,2,1],[3,0,3,1]]}
["AEP Texas - Central Area"]
[{"$f":"IF(A3=\"All Rate Codes\",\"Billing Determinants for\",\"Billing Determinants for Rate Code\")","v":"Billing Determinants for"}]
["All Rate Codes"]
[{"$f":"IF(A3=\"All Rate Codes\",\"\",VLOOKUP(A3,'TCCRate code Table'!A8:C202,3,FALSE))","v":""}]
["SECONDARY VOLTAGE SERVICE GREATER THAN 10 KW"]
[null,null,"810_02",null,null,null,null,"Estimated Next"]
[null,null,"SAC04","Approved Rate",null,"Docket","Effective","Revision or","Applicable Rate Codes"]
["Description of Charge or Rider",null,"Code","Cost / Unit",null,"Number","Date","Termination Date",830,831,833,834,835,836,837,838,839,853,855,856,857,858]
["BASE CHARGES",null,null,null,null,null,null,null,"x","x","x","x","x","x","x","x","x","x","x","x","x","x"]
["Customer Charge (non-IDR Metered)",null,"BAS001",3.26,"per month",34561,"2008-03-31","Not Scheduled","x","x","x",null,null,"x",null,"x",null,null,"x",null,"x"]
{"$rows_left_out":59}
{"sheet":"TCCPrimary","index":12,"n_rows":68,"n_cols":16,"rows_kept":68,"cut":false,"hidden":false,"merged":[[6,8,6,15],[8,0,8,1],[6,3,6,4],[7,3,7,4],[0,0,0,1],[1,0,1,1],[2,0,2,1],[3,0,3,1]]}
["AEP Texas - Central Area"]
[{"$f":"IF(A3=\"All Rate Codes\",\"Billing Determinants for\",\"Billing Determinants for Rate Code\")","v":"Billing Determinants for"}]
["All Rate Codes"]
[{"$f":"IF(A3=\"All Rate Codes\",\"\",VLOOKUP(A3,'TCCRate code Table'!A8:C202,3,FALSE))","v":""}]
["PRIMARY VOLTAGE SERVICE"]
[null,null,"810_02",null,null,null,null,"Estimated"]
[null,null,"SAC04","Approved Rate",null,"Docket","Effective","Revision or","Applicable Rate Codes"]
["Description of Charge or Rider",null,"Code","Cost / Unit",null,"Number","Date","Termination Date",841,842,844,845,846,847,848,849]
["BASE CHARGES",null,null,null,null,null,null,null,"x","x","x","x","x","x","x","x"]
["Customer Charge (non-IDR Metered)",null,"BAS001",3.8,"per month",34561,"2008-03-31","Not Scheduled","x",null,"x",null,"x",null,"x"]
{"$rows_left_out":59}
{"sheet":"TCCTrans","index":13,"n_rows":16,"n_cols":19,"rows_kept":16,"cut":false,"hidden":false,"merged":[[6,8,6,18],[7,3,7,4],[8,0,8,1],[6,3,6,4],[0,0,0,1],[1,0,1,1],[2,0,2,1],[3,0,3,1]]}
["AEP Texas - Central Area"]
[{"$f":"IF(A3=\"All Rate Codes\",\"Billing Determinants for\",\"Billing Determinants for Rate Code\")","v":"Billing Determinants for"}]
["All Rate Codes"]
[{"$f":"IF(A3=\"All Rate Codes\",\"\",VLOOKUP(A3,'TCCRate code Table'!A8:C202,3,FALSE))","v":""}]
["TRANSMISSION VOLTAGE SERVICE"]
[null,null,"810_02",null,null,null,null,"Estimated"]
[null,null,"SAC04","Approved Rate",null,"Docket","Effective","Revision or","Applicable Rate Codes"]
["Description of Charge or Rider",null,"Code","Cost / Unit",null,"Number","Date","Termination Date",860,863,864,865,866,870,871,872,873,874,875]
[null,null,null,null,null,null,null,null,"X","X","X","X","X","X","X","X","X","X","X"]
[null,null,null,null,null,null,null,null,"X","X","X","X","X","X","X","X","X","X","X"]
{"$rows_left_out":7}
{"sheet":"TCC StreetLgt","index":14,"n_rows":38,"n_cols":12,"rows_kept":38,"cut":false,"hidden":false,"merged":[[5,8,5,11],[8,0,8,1],[6,3,6,4],[7,3,7,4],[0,0,0,1],[1,0,1,1],[2,0,2,1],[3,0,3,1]]}
["AEP Texas - Central Area"]
[{"$f":"IF(A3=\"All Rate Codes\",\"Billing Determinants for\",\"Billing Determinants for Rate Code\")","v":"Billing Determinants for"}]
["All Rate Codes"]
[{"$f":"IF(A3=\"All Rate Codes\",\"\",VLOOKUP(A3,'TCCRate code Table'!A8:C202,3,FALSE))","v":""}]
["MUNICIPAL STREET LIGHTING SERVICE"]
[null,null,"810_02",null,null,null,null,"Estimated","Monthly Facilities Rate"]
[null,null,"SAC04","Approved Rate",null,"Docket","Effective","Revision or","Rate",null,"kWh","Facility"]
["Description of Charge or Rider",null,"Code","Cost / Unit",null,"Number","Date","Termination Date","Code","Description","Usage","Price"]
["BASE CHARGES",null,null,null,null,null,null,null,null,"Mercury Vapor (MV)"]
["Customer Charge",null,"BAS001",3.2,"per month",35093,"2008-01-30","Not Scheduled",931,"MV 100 Watt ",40,4.0999999999999996]
{"$rows_left_out":29}
{"sheet":"TCC NonRoadway","index":15,"n_rows":32,"n_cols":12,"rows_kept":32,"cut":false,"hidden":false,"merged":[[5,8,5,11],[8,0,8,1],[6,3,6,4],[7,3,7,4],[0,0,0,1],[1,0,1,1],[2,0,2,1],[3,0,3,1]]}
["AEP Texas - Central Area"]
[{"$f":"IF(A3=\"All Rate Codes\",\"Billing Determinants for\",\"Billing Determinants for Rate Code\")","v":"Billing Determinants for"}]
["All Rate Codes"]
[{"$f":"IF(A3=\"All Rate Codes\",\"\",VLOOKUP(A3,'TCCRate code Table'!A8:C202,3,FALSE))","v":""}]
["NON-ROADWAY LIGHTING SERVICE"]
[null,null,"810_02",null,null,null,null,"Estimated","Monthly Facilities Rate"]
[null,null,"SAC04","Approved Rate",null,"Docket ","Effective","Revision or","Rate",null,"kWh","Facility"]
["Description of Charge or Rider",null,"Code","Cost / Unit",null,"Number","Date","Termination Date","Code","Description","Usage","Price"]
["BASE CHARGES",null,null,null,null,null,null,null,"Security Lighting"]
[null,null,null,null,null,null,null,null,null,"Mercury Vapor (MV)"]
{"$rows_left_out":23}
{"sheet":"TNCResidential","index":16,"n_rows":68,"n_cols":17,"rows_kept":68,"cut":false,"hidden":false,"merged":[[8,0,8,1],[6,3,6,4],[1,0,1,1],[0,0,0,1],[2,0,2,1],[3,0,3,1],[6,8,6,16],[7,3,7,4]]}
["AEP Texas - North Area"]
[{"$f":"IF(A3=\"All Rate Codes\",\"Billing Determinants for\",\"Billing Determinants for Rate Code\")","v":"Billing Determinants for"}]
["All Rate Codes"]
[{"$f":"IF(A3=\"All Rate Codes\",\"\",VLOOKUP(A3,'TNCRate code Table'!A8:C206,3,FALSE))","v":""}]
["RESIDENTIAL  SERVICE"]
[null,null,"810_02",null,null,null,null,"Estimated"]
[null,null,"SAC04","Approved Rate",null,"Docket","Effective","Revision or","Applicable Rate Codes"]
["Description of Charge or Rider",null,"Code","Cost / Unit",null," Number","Date","Termination Date",820]
["BASE CHARGES",null,null,null,null,null,null,null,"x","x","x","x","x","x","x","x","x"]
["Customer Charge",null,"BAS001",2.94,"per month",33310,"2007-05-30","Not Scheduled","x"]
{"$rows_left_out":59}
{"sheet":"TNCSec<10KW","index":17,"n_rows":68,"n_cols":17,"rows_kept":68,"cut":false,"hidden":false,"merged":[[6,8,6,12],[7,3,7,4],[8,0,8,1],[6,3,6,4],[0,0,0,1],[1,0,1,1],[2,0,2,1],[3,0,3,1]]}
["AEP Texas - North Area"]
[{"$f":"IF(A3=\"All Rate Codes\",\"Billing Determinants for\",\"Billing Determinants for Rate Code\")","v":"Billing Determinants for"}]
["All Rate Codes"]
[{"$f":"IF(A3=\"All Rate Codes\",\"\",VLOOKUP(A3,'TNCRate code Table'!A8:C206,3,FALSE))","v":""}]
["SECONDARY VOLTAGE SERVICE LESS THAN OR EQUAL TO 10 KW"]
[null,null,"810_02",null,null,null,null,"Estimated"]
[null,null,"SAC04","Approved Rate",null,"Docket","Effective","Revision or","Applicable Rate Codes"]
["Description of Charge or Rider",null,"Code","Cost / Unit",null," Number","Date","Termination Date",824,825,829,850,852]
["BASE CHARGES",null,null,null,null,null,null,null,"x","x","x","x","x","X","X","X","X"]
["Customer Charge",null,"BAS001",4.25,"per month",33310,"2007-05-30","Not Scheduled","x","x","x","x","x"]
{"$rows_left_out":59}
{"sheet":"TNCSec>=10KW","index":18,"n_rows":68,"n_cols":22,"rows_kept":68,"cut":false,"hidden":false,"merged":[[6,8,6,18],[7,3,7,4],[8,0,8,1],[6,3,6,4],[0,0,0,1],[1,0,1,1],[2,0,2,1],[3,0,3,1]]}
["AEP Texas - North Area"]
[{"$f":"IF(A3=\"All Rate Codes\",\"Billing Determinants for\",\"Billing Determinants for Rate Code\")","v":"Billing Determinants for"}]
["All Rate Codes"]
[{"$f":"IF(A3=\"All Rate Codes\",\"\",VLOOKUP(A3,'TNCRate code Table'!A8:C206,3,FALSE))","v":""}]
["SECONDARY VOLTAGE SERVICE GREATER THAN 10 KW"]
[null,null,"810_02",null,null,null,null,"Estimated Next"]
[null,null,"SAC04","Approved Rate",null,"Docket","Effective","Revision or","Applicable Rate Codes"]
["Description of Charge or Rider",null,"Code","Cost / Unit",null," Number","Date","Termination Date",830,831,832,833,835,836,837,838,839,857,858]
["BASE CHARGES",null,null,null,null,null,null,null,"x","x","x","x","x","x","x","x","x","x","x","X","X","X"]
["Customer Charge (Non-IDR Metered)",null,"BAS001",4.25,"per month",34561,"2008-03-31","Not Scheduled","x","x","x","x","x","x",null,"x",null,"x"]
{"$rows_left_out":59}
{"sheet":"TNCPrimary","index":19,"n_rows":68,"n_cols":19,"rows_kept":68,"cut":false,"hidden":false,"merged":[[8,0,8,1],[6,8,6,13],[6,3,6,4],[7,3,7,4],[0,0,0,1],[1,0,1,1],[2,0,2,1],[3,0,3,1]]}
["AEP Texas - North Area"]
[{"$f":"IF(A3=\"All Rate Codes\",\"Billing Determinants for\",\"Billing Determinants for Rate Code\")","v":"Billing Determinants for"}]
["All Rate Codes"]
[{"$f":"IF(A3=\"All Rate Codes\",\"\",VLOOKUP(A3,'TNCRate code Table'!A8:C206,3,FALSE))","v":""}]
["PRIMARY VOLTAGE SERVICE"]
[null,null,"810_02",null,null,null,null,"Estimated"]
[null,null,"SAC04","Approved Rate",null,"Docket","Effective","Revision or","Applicable Rate Codes"]
["Description of Charge or Rider",null,"Code","Cost / Unit",null," Number","Date","Termination Date",841,842,844,845,846,847]
["BASE CHARGES",null,null,null,null,null,null,null,"x","x","x","x","x","x","X","X","X","X","X"]
["Customer Charge (Non-IDR Metered)",null,"BAS001",4.25,"per month",34561,"2008-03-31","Not Scheduled","x",null,"x",null,"x"]
{"$rows_left_out":59}
{"sheet":"TNCTrans","index":20,"n_rows":16,"n_cols":19,"rows_kept":16,"cut":false,"hidden":false,"merged":[[8,0,8,1],[6,8,6,12],[6,3,6,4],[7,3,7,4],[0,0,0,1],[1,0,1,1],[2,0,2,1],[3,0,3,1]]}
["AEP Texas - North Area"]
[{"$f":"IF(A3=\"All Rate Codes\",\"Billing Determinants for\",\"Billing Determinants for Rate Code\")","v":"Billing Determinants for"}]
["All Rate Codes"]
[{"$f":"IF(A3=\"All Rate Codes\",\"\",VLOOKUP(A3,'TNCRate code Table'!A8:C206,3,FALSE))","v":""}]
["TRANSMISSION VOLTAGE SERVICE"]
[null,null,"810_02",null,null,null,null,"Estimated"]
[null,null,"SAC04","Approved Rate",null,"Docket","Effective","Revision or","Applicable Rate Codes"]
["Description of Charge or Rider",null,"Code","Cost / Unit",null," Number","Date","Termination Date",860,861,862]
[null,null,null,null,null,null,null,null,"X","X","X","X","X","X","X","X","X","X","X"]
[null,null,null,null,null,null,null,null,"X","X","X","X","X","X","X","X","X","X","X"]
{"$rows_left_out":7}
{"sheet":"TNC StreetLgt","index":21,"n_rows":31,"n_cols":12,"rows_kept":31,"cut":false,"hidden":false,"merged":[[5,8,5,11],[8,0,8,1],[6,3,6,4],[7,3,7,4],[0,0,0,1],[1,0,1,1],[2,0,2,1],[3,0,3,1]]}
["AEP Texas - North Area"]
[{"$f":"IF(A3=\"All Rate Codes\",\"Billing Determinants for\",\"Billing Determinants for Rate Code\")","v":"Billing Determinants for"}]
["All Rate Codes"]
[{"$f":"IF(A3=\"All Rate Codes\",\"\",VLOOKUP(A3,'TNCRate code Table'!A8:C206,3,FALSE))","v":""}]
["MUNICIPAL STREET LIGHTING SERVICE"]
[null,null,"810_02",null,null,null,null,"Estimated","Monthly Facilities Rate"]
[null,null,"SAC04","Approved Rate",null,"Docket","Effective","Revision or","Rate",null,"kWh","Facility"]
["Description of Charge or Rider",null,"Code","Cost / Unit",null," Number","Date","Termination Date","Code","Description","Usage","Price"]
[null,null,null,null,null,null,null,null,null,"Mercury Vapor (MV)"]
["Customer Charge",null,"BAS001",4.25,"per month ",35381,"2008-03-31","Not Scheduled",932,"MV 175 Watt ",70,4.84]
{"$rows_left_out":22}
{"sheet":"TNC NonRoadway","index":22,"n_rows":32,"n_cols":12,"rows_kept":32,"cut":false,"hidden":false,"merged":[[5,8,5,11],[8,0,8,1],[6,3,6,4],[7,3,7,4],[0,0,0,1],[1,0,1,1],[2,0,2,1],[3,0,3,1]]}
["AEP Texas - North Area"]
[{"$f":"IF(A3=\"All Rate Codes\",\"Billing Determinants for\",\"Billing Determinants for Rate Code\")","v":"Billing Determinants for"}]
["All Rate Codes"]
[{"$f":"IF(A3=\"All Rate Codes\",\"\",VLOOKUP(A3,'TNCRate code Table'!A8:C206,3,FALSE))","v":""}]
["NON-ROADWAY LIGHTING SERVICE"]
[null,null,"810_02",null,null,null,null,"Estimated","Monthly Facilities Rate"]
[null,null,"SAC04","Approved Rate",null,"Docket","Effective","Revision or","Rate",null,"kWh","Facility"]
["Description of Charge or Rider",null,"Code","Cost / Unit",null," Number","Date","Termination Date","Code","Description","Usage","Price"]
["BASE CHARGES",null,null,null,null,null,null,null,"Security Lighting"]
[null,null,null,null,null,null,null,null,null,"Mercury Vapor (MV)"]
{"$rows_left_out":23}
{"sheet":"Transmission","index":23,"n_rows":39,"n_cols":7,"rows_kept":39,"cut":false,"hidden":true,"merged":[[2,0,2,5]]}
[]
[]
["CPL TRANSMISSION SERVICE"]
[{"$f":"TCCPrimary!A5","v":"PRIMARY VOLTAGE SERVICE"}]
[null,null,null,null,9600000,"KWH"]
[null,null,null,null,5500,"KW"]
[null,null,null,null,{"$f":"ROUND((E5/E6)/8760,2)","v":0.2}]
[]
[]
["Transmission and Distribution Charges"]
{"$rows_left_out":29}